BDBM50357162 CHEMBL1917859
SMILES COc1ccc(cc1CN[C@H]1CCN(C[C@H]1c1ccccc1)C(=O)NC1CC1)-n1nnnc1C(F)(F)F
InChI Key InChIKey=DNWDXVUEVAPELT-SFTDATJTSA-N
Data  1 IC50
  Tab Delimited (TSV)   2D SDfile   Computed 3D by Vconf -m prep SDfile
Find this compound or compounds like it in BindingDB:
Activity Spreadsheet -- Enzyme Inhibition Constant Data from BindingDB
Found 1 hit for monomerid = 50357162
TargetSubstance-P receptor(Homo sapiens (Human))
Takeda Pharmaceutical
Curated by ChEMBL
LigandPNGBDBM50357162(CHEMBL1917859)
Affinity DataIC50:  0.0560nM. Assay description: Displacement of [125I]BH-SP from NK1 receptor in human IM9 cells after 30 mins by scintillation counting
In DepthDetails ArticlePubMed