BDBM50357178 CHEMBL1917845
SMILES CCNC(=O)N1CC[C@H](NCc2cc(OC(F)(F)F)ccc2OC)[C@@H](C1)c1ccccc1
InChI Key InChIKey=HIHKWWMEJLAOLH-PMACEKPBSA-N
Data  1 IC50
  Tab Delimited (TSV)   2D SDfile   Computed 3D by Vconf -m prep SDfile
Find this compound or compounds like it in BindingDB:
Activity Spreadsheet -- Enzyme Inhibition Constant Data from BindingDB
Found 1 hit for monomerid = 50357178
TargetSubstance-P receptor(Homo sapiens (Human))
Takeda Pharmaceutical
Curated by ChEMBL
LigandPNGBDBM50357178(CHEMBL1917845)
Affinity DataIC50:  0.170nM. Assay description: Displacement of [125I]BH-SP from NK1 receptor in human IM9 cells after 30 mins by scintillation counting
In DepthDetails ArticlePubMed