BDBM50357210 CHEMBL1230782
SMILES CC[C@H](N)C(O)=O
InChI Key InChIKey=QWCKQJZIFLGMSD-VKHMYHEASA-N
Data  1 KI
  Tab Delimited (TSV)   2D SDfile   Computed 3D by Vconf -m prep SDfile
Find this compound or compounds like it in BindingDB:
Activity Spreadsheet -- Enzyme Inhibition Constant Data from BindingDB
Found 1 hit for monomerid = 50357210
TargetProton-coupled amino acid transporter 1(Homo sapiens (Human))
Martin-Luther-University Halle-Wittenberg
Curated by ChEMBL
LigandPNGBDBM50357210(CHEMBL1230782)
Affinity DataKi:  3.50E+7nM. Assay description: Inhibition of human PAT1-mediated L-[3H]proline uptake in human Caco2 cells after 10 mins by liquid scintillation countingChecked by Author
In DepthDetails ArticlePubMed