BDBM50357345 CHEMBL1916903
SMILES CN(C)C\C=C\C(=O)N(C)c1ccc2nc(Sc3ccccc3C)c3cncn3c2c1
InChI Key InChIKey=QZEKMXLWXCWZKO-JXMROGBWSA-N
Data  2 IC50
  Tab Delimited (TSV)   2D SDfile   Computed 3D by Vconf -m prep SDfile
Find this compound or compounds like it in BindingDB:
Activity Spreadsheet -- Enzyme Inhibition Constant Data from BindingDB
Found 2 hits for monomerid = 50357345
TargetTyrosine-protein kinase Lyn(Homo sapiens (Human))
Pfizer
Curated by ChEMBL
LigandPNGBDBM50357345(CHEMBL1916903)
Affinity DataIC50:  1.96E+4nM. Assay description: Inhibition of LYN-A expressed in Sf9 cells after 60 mins by TR-FRET Assay
In DepthDetails ArticlePubMed
TargetTyrosine-protein kinase BTK(Homo sapiens (Human))
Pfizer
Curated by ChEMBL
LigandPNGBDBM50357345(CHEMBL1916903)
Affinity DataIC50:  283nM. Assay description: Inhibition of human full-length BTK expressed in Sf9 cells using FAM-Srctide peptide as substrate after 60 mins by TR-FRET Assay
In DepthDetails ArticlePubMed