BDBM50357384 CHEMBL1917275
SMILES Fc1ccc(CSc2nnc(o2)-c2ccc3OCCOc3c2)c(F)c1
InChI Key InChIKey=IJOKOKLRFXBXIG-UHFFFAOYSA-N
Data  1 IC50
  Tab Delimited (TSV)   2D SDfile   Computed 3D by Vconf -m prep SDfile
Find this compound or compounds like it in BindingDB:
Activity Spreadsheet -- Enzyme Inhibition Constant Data from BindingDB
Found 1 hit for monomerid = 50357384
TargetTelomerase reverse transcriptase(Homo sapiens (Human))
Nanjing University
Curated by ChEMBL
LigandPNGBDBM50357384(CHEMBL1917275)
Affinity DataIC50:  2.44E+3nM. Assay description: Inhibition of telomerase in human SW1116 cells after 24 hrs by TRAP-PCR-ELISA assay
In DepthDetails ArticlePubMed