BDBM50357589 CHEMBL1915440
SMILES Fc1cccc(Nc2nc3c(cccc3c3cnccc23)-c2nnc[nH]2)c1
InChI Key InChIKey=AZWJVNNXHBOAKD-UHFFFAOYSA-N
Data  2 IC50
  Tab Delimited (TSV)   2D SDfile   Computed 3D by Vconf -m prep SDfile
Find this compound or compounds like it in BindingDB:
Activity Spreadsheet -- Enzyme Inhibition Constant Data from BindingDB
Found 2 hits for monomerid = 50357589
TargetSerine/threonine-protein kinase pim-2(Homo sapiens (Human))
Cylene Pharmaceuticals
Curated by ChEMBL
LigandPNGBDBM50357589(CHEMBL1915440)
Affinity DataIC50:  59nM. Assay description: Inhibition of human recombinant Pim2 using RSRHSSYPAGT as substrate by radiometric assay in the presence of 5 uM [ATP]
In DepthDetails ArticlePubMed
TargetSerine/threonine-protein kinase pim-1(Homo sapiens (Human))
Cylene Pharmaceuticals
Curated by ChEMBL
LigandPNGBDBM50357589(CHEMBL1915440)
Affinity DataIC50:  74nM. Assay description: Inhibition of human recombinant Pim1 using RSRHSSYPAGT as substrate by radiometric assay in the presence of 30 uM [ATP]
In DepthDetails ArticlePubMed