BDBM50357592 CHEMBL1915443
SMILES Cc1ccccc1Nc1nc2c(cccc2c2cnccc12)-c1nnc[nH]1
InChI Key InChIKey=YZAAXAWPNUWNKE-UHFFFAOYSA-N
Data  3 IC50
  Tab Delimited (TSV)   2D SDfile   Computed 3D by Vconf -m prep SDfile
Find this compound or compounds like it in BindingDB:
Activity Spreadsheet -- Enzyme Inhibition Constant Data from BindingDB
Found 3 hits for monomerid = 50357592
TargetSerine/threonine-protein kinase pim-1(Homo sapiens (Human))
Cylene Pharmaceuticals
Curated by ChEMBL
LigandPNGBDBM50357592(CHEMBL1915443)
Affinity DataIC50:  7nM. Assay description: Inhibition of human recombinant Pim1 using RSRHSSYPAGT as substrate by radiometric assay in the presence of 30 uM [ATP]
In DepthDetails ArticlePubMed
TargetSerine/threonine-protein kinase pim-1(Homo sapiens (Human))
Cylene Pharmaceuticals
Curated by ChEMBL
LigandPNGBDBM50357592(CHEMBL1915443)
Affinity DataIC50:  7nM. Assay description: Inhibition of human recombinant PIM1 in presence of ATP by ELISA based spectrophotometric analysis
In DepthDetails ArticlePubMed
TargetSerine/threonine-protein kinase pim-2(Homo sapiens (Human))
Cylene Pharmaceuticals
Curated by ChEMBL
LigandPNGBDBM50357592(CHEMBL1915443)
Affinity DataIC50:  6nM. Assay description: Inhibition of human recombinant Pim2 using RSRHSSYPAGT as substrate by radiometric assay in the presence of 5 uM [ATP]
In DepthDetails ArticlePubMed