BDBM50357785 CHEMBL1916562
SMILES OC(=O)CC(=O)N1CCc2cc(ccc12)-c1noc(n1)-c1cc(cc(c1)C(F)(F)F)C(F)(F)F
InChI Key InChIKey=WOHMVIBHCWICGW-UHFFFAOYSA-N
Data  1 EC50
  Tab Delimited (TSV)   2D SDfile   Computed 3D by Vconf -m prep SDfile
Find this compound or compounds like it in BindingDB:
Activity Spreadsheet -- Enzyme Inhibition Constant Data from BindingDB
Found 1 hit for monomerid = 50357785
TargetSphingosine 1-phosphate receptor 1(Homo sapiens (Human))
Arena Pharmaceuticals
Curated by ChEMBL
LigandPNGBDBM50357785(CHEMBL1916562)
Affinity DataEC50:  102nM. Assay description: Agonist activity at human S1P1 receptor expressed in HEK293 cells assessed as inhibition of forskolin-stimulated cAMP production after 1 hr by HTRF a...
In DepthDetails ArticlePubMed