BDBM50357825 CHEMBL1915891
SMILES COc1ccc2nc(C)c3c(C)nc(-c4cc(Cl)ccc4Cl)n3c2n1
InChI Key InChIKey=RMKFHXBPLKSLMZ-UHFFFAOYSA-N
Data  11 IC50
  Tab Delimited (TSV)   2D SDfile   Computed 3D by Vconf -m prep SDfile
Find this compound or compounds like it in BindingDB:
Activity Spreadsheet -- Enzyme Inhibition Constant Data from BindingDB
Found 11 hits for monomerid = 50357825
TargetcGMP-specific 3',5'-cyclic phosphodiesterase(Homo sapiens (Human))
Pfizer
Curated by ChEMBL
LigandPNGBDBM50357825(CHEMBL1915891)
Affinity DataIC50: >1.00E+3nM. Assay description: Inhibition of recombinant human PDE5A using [3H]cGMP after 1 hr by scintillation proximity assay
In DepthDetails ArticlePubMed
TargetDual 3',5'-cyclic-AMP and -GMP phosphodiesterase 11A(Homo sapiens (Human))
Pfizer
Curated by ChEMBL
LigandPNGBDBM50357825(CHEMBL1915891)
Affinity DataIC50: >1.00E+3nM. Assay description: Inhibition of recombinant human PDE11A using [3H]cAMP after 1 hr by scintillation proximity assay
In DepthDetails ArticlePubMed
LigandPNGBDBM50357825(CHEMBL1915891)
Affinity DataIC50:  7.40nM. Assay description: Inhibition of N-terminal His-tagged human PDE10A expressed in Escherichia coli using [3H]cAMP after 1 hr by scintillation proximity assay
In DepthDetails ArticlePubMed
TargetcGMP-inhibited 3',5'-cyclic phosphodiesterase 3A(Homo sapiens (Human))
Pfizer
Curated by ChEMBL
LigandPNGBDBM50357825(CHEMBL1915891)
Affinity DataIC50: >1.00E+3nM. Assay description: Inhibition of recombinant human PDE3A using [3H]cAMP after 1 hr by scintillation proximity assay
In DepthDetails ArticlePubMed
TargetcAMP-specific 3',5'-cyclic phosphodiesterase 4A(Homo sapiens (Human))
Pfizer
Curated by ChEMBL
LigandPNGBDBM50357825(CHEMBL1915891)
Affinity DataIC50: >1.00E+3nM. Assay description: Inhibition of recombinant human PDE4A using [3H]cAMP after 1 hr by scintillation proximity assay
In DepthDetails ArticlePubMed
LigandPNGBDBM50357825(CHEMBL1915891)
Affinity DataIC50: >1.00E+3nM. Assay description: Inhibition of recombinant human PDE1B using [3H]cAMP after 1 hr by scintillation proximity assay
In DepthDetails ArticlePubMed
TargetHigh affinity cAMP-specific 3',5'-cyclic phosphodiesterase 7A(Homo sapiens (Human))
Pfizer
Curated by ChEMBL
LigandPNGBDBM50357825(CHEMBL1915891)
Affinity DataIC50:  332nM. Assay description: Inhibition of recombinant human PDE7A using [3H]cAMP after 1 hr by scintillation proximity assay
In DepthDetails ArticlePubMed
TargetcGMP-dependent 3',5'-cyclic phosphodiesterase(Homo sapiens (Human))
Pfizer
Curated by ChEMBL
LigandPNGBDBM50357825(CHEMBL1915891)
Affinity DataIC50:  11nM. Assay description: Inhibition of recombinant human PDE2A using [3H]cAMP after 1 hr by scintillation proximity assay
In DepthDetails ArticlePubMed
LigandPNGBDBM50357825(CHEMBL1915891)
Affinity DataIC50: >1.00E+3nM. Assay description: Inhibition of recombinant human PDE8A using [3H]cAMP after 1 hr by scintillation proximity assay
In DepthDetails ArticlePubMed
TargetHigh affinity cGMP-specific 3',5'-cyclic phosphodiesterase 9A(Homo sapiens (Human))
Pfizer
Curated by ChEMBL
LigandPNGBDBM50357825(CHEMBL1915891)
Affinity DataIC50: >1.00E+3nM. Assay description: Inhibition of recombinant human PDE9A using [3H]cGMP after 1 hr by scintillation proximity assay
In DepthDetails ArticlePubMed
LigandPNGBDBM50357825(CHEMBL1915891)
Affinity DataIC50: >1.00E+3nM. Assay description: Inhibition of recombinant bovine PDE6A using [3H]cGMP after 1 hr by scintillation proximity assay
In DepthDetails ArticlePubMed