BDBM50357874 CHEMBL1916134
SMILES COc1cc(F)c2nc(C)c3c(C)nc(-c4ccncc4C)n3c2c1
InChI Key InChIKey=KNPRYLFUIRHVFZ-UHFFFAOYSA-N
Data  2 IC50
  Tab Delimited (TSV)   2D SDfile   Computed 3D by Vconf -m prep SDfile
Find this compound or compounds like it in BindingDB:
Activity Spreadsheet -- Enzyme Inhibition Constant Data from BindingDB
Found 2 hits for monomerid = 50357874
LigandPNGBDBM50357874(CHEMBL1916134)
Affinity DataIC50:  3.90nM. Assay description: Inhibition of N-terminal His-tagged human PDE10A expressed in Escherichia coli using [3H]cAMP after 1 hr by scintillation proximity assay
In DepthDetails ArticlePubMed
TargetcGMP-dependent 3',5'-cyclic phosphodiesterase(Homo sapiens (Human))
Pfizer
Curated by ChEMBL
LigandPNGBDBM50357874(CHEMBL1916134)
Affinity DataIC50:  71nM. Assay description: Inhibition of recombinant human PDE2A using [3H]cAMP after 1 hr by scintillation proximity assay
In DepthDetails ArticlePubMed