BDBM50357942 CHEMBL1916767
SMILES Nc1c2CCCCCc2nc2oc(cc12)-c1ccccc1
InChI Key InChIKey=OQGBUSPYXSZWQT-UHFFFAOYSA-N
Data  2 IC50
  Tab Delimited (TSV)   2D SDfile   Computed 3D by Vconf -m prep SDfile
Find this compound or compounds like it in BindingDB:
Activity Spreadsheet -- Enzyme Inhibition Constant Data from BindingDB
Found 2 hits for monomerid = 50357942
TargetCholinesterase(Equus caballus (Horse))
University Of Lisbon
Curated by ChEMBL
LigandPNGBDBM50357942(CHEMBL1916767)
Affinity DataIC50:  6.00E+3nM. Assay description: Inhibition of equine serum BuChE using butylthiocholine iodide as substrate preincubated for 10 mins before substrate addition by Ellman's method
In DepthDetails ArticlePubMed
TargetAcetylcholinesterase(Electrophorus electricus (Electric eel))
University Of Lisbon
Curated by ChEMBL
LigandPNGBDBM50357942(CHEMBL1916767)
Affinity DataIC50: >1.00E+5nM. Assay description: Inhibition of Electrophorus electricus AChE using acetylthiocholine iodide as substrate preincubated for 10 mins before substrate addition by Ellman'...
In DepthDetails ArticlePubMed