BDBM50357946 CHEMBL1916926
SMILES Cc1ccc(cc1)-c1cc2c(N)c3CCCCCc3nc2o1
InChI Key InChIKey=OQWWJWLANXKPCC-UHFFFAOYSA-N
Data  2 IC50
  Tab Delimited (TSV)   2D SDfile   Computed 3D by Vconf -m prep SDfile
Find this compound or compounds like it in BindingDB:
Activity Spreadsheet -- Enzyme Inhibition Constant Data from BindingDB
Found 2 hits for monomerid = 50357946
TargetCholinesterase(Equus caballus (Horse))
University Of Lisbon
Curated by ChEMBL
LigandPNGBDBM50357946(CHEMBL1916926)
Affinity DataIC50:  1.30E+4nM. Assay description: Inhibition of equine serum BuChE using butylthiocholine iodide as substrate preincubated for 10 mins before substrate addition by Ellman's method in ...
In DepthDetails ArticlePubMed
TargetAcetylcholinesterase(Electrophorus electricus (Electric eel))
University Of Lisbon
Curated by ChEMBL
LigandPNGBDBM50357946(CHEMBL1916926)
Affinity DataIC50: >3.00E+4nM. Assay description: Inhibition of Electrophorus electricus AChE using acetylthiocholine iodide as substrate preincubated for 10 mins before substrate addition by Ellman'...
In DepthDetails ArticlePubMed