BDBM50358007 CHEMBL1917340
SMILES NCCCN(CCCCN1CCc2ccccc2C1)S(=O)(=O)c1ccccc1
InChI Key InChIKey=TZCUVQHTSAIQRA-UHFFFAOYSA-N
Data  1 KI
  Tab Delimited (TSV)   2D SDfile   Computed 3D by Vconf -m prep SDfile
Find this compound or compounds like it in BindingDB:
Activity Spreadsheet -- Enzyme Inhibition Constant Data from BindingDB
Found 1 hit for monomerid = 50358007
Target5-hydroxytryptamine receptor 7(Homo sapiens (Human))
Jagiellonian University Medical College
Curated by ChEMBL
LigandPNGBDBM50358007(CHEMBL1917340)
Affinity DataKi:  235nM. Assay description: Displacement of [3H]-5-CT from human 5-HT7 receptor expressed in HEK293 cells after 1 hr by liquid scintillation counting
In DepthDetails ArticlePubMed