BDBM50358054 CHEMBL1914661
SMILES CC(Nc1ncnc2[nH]c(cc12)-c1ccc(O)cc1)c1cccc(C)c1
InChI Key InChIKey=COSOLTZPQMSGJG-UHFFFAOYSA-N
Data  1 IC50
  Tab Delimited (TSV)   2D SDfile   Computed 3D by Vconf -m prep SDfile
Find this compound or compounds like it in BindingDB:
Activity Spreadsheet -- Enzyme Inhibition Constant Data from BindingDB
Found 1 hit for monomerid = 50358054
TargetEpidermal growth factor receptor(Homo sapiens (Human))
Norwegian University Of Science And Technology
Curated by ChEMBL
LigandPNGBDBM50358054(CHEMBL1914661)
Affinity DataIC50:  95nM. Assay description: Inhibition of EGFR by Z-LYTE assay
In DepthDetails ArticlePubMed