BDBM50358115 CHEMBL1915935
SMILES COc1cccc(CN(C)C(=O)c2ccc(cc2)-c2cccc(OC)c2)c1
InChI Key InChIKey=UGMVOQIAJOOOEU-UHFFFAOYSA-N
Data  4 IC50
  Tab Delimited (TSV)   2D SDfile   Computed 3D by Vconf -m prep SDfile
Find this compound or compounds like it in BindingDB:
Activity Spreadsheet -- Enzyme Inhibition Constant Data from BindingDB
Found 4 hits for monomerid = 50358115
Target17-beta-hydroxysteroid dehydrogenase type 1(Homo sapiens (Human))
Saarland University
Curated by ChEMBL
LigandPNGBDBM50358115(CHEMBL1915935)
Affinity DataIC50: >1.00E+5nM. Assay description: Inhibition of human placental 17beta-HSD1 using [2,4,6,7-3H]-estrone as substrate after 10 mins by radio flow detector-based HPLC analysis in presenc...
In DepthDetails ArticlePubMed
Target17-beta-hydroxysteroid dehydrogenase type 2(Homo sapiens (Human))
Saarland University
Curated by ChEMBL
LigandPNGBDBM50358115(CHEMBL1915935)
Affinity DataIC50:  494nM. Assay description: Inhibition of human placenta 17beta-HSD2 microsomal fraction using unlabeled, [2,4,6,7-3H]-estradiol as substrate after 20 mins by HPLC analysis in p...
In DepthDetails ArticlePubMed
Target17-beta-hydroxysteroid dehydrogenase type 1(Homo sapiens (Human))
Saarland University
Curated by ChEMBL
LigandPNGBDBM50358115(CHEMBL1915935)
Affinity DataIC50: >1.00E+5nM. Assay description: Inhibition of human placenta 17beta-HSD1 cytosolic fraction using unlabeled, [2,4,6,7-3H]-estrone as substrate after 20 mins by HPLC analysis in pres...
In DepthDetails ArticlePubMed
Target17-beta-hydroxysteroid dehydrogenase type 2(Homo sapiens (Human))
Saarland University
Curated by ChEMBL
LigandPNGBDBM50358115(CHEMBL1915935)
Affinity DataIC50:  494nM. Assay description: Inhibition of human placental 17beta-HSD2 assessed as formation of [2,4,6,7-3H]-estrone using [2,4,6,7-3H]-estradiol as substrate after 20 mins by ra...
In DepthDetails ArticlePubMed