BDBM50358294 CHEMBL1922409
SMILES O=c1[nH]ccc2c(Cc3nnc4ccc(nn34)N3CCCCC3)cccc12
InChI Key InChIKey=ZLUHAKANEOYBRI-UHFFFAOYSA-N
Data  1 IC50
  Tab Delimited (TSV)   2D SDfile   Computed 3D by Vconf -m prep SDfile
Find this compound or compounds like it in BindingDB:
Activity Spreadsheet -- Enzyme Inhibition Constant Data from BindingDB
Found 1 hit for monomerid = 50358294
TargetHepatocyte growth factor receptor(Homo sapiens (Human))
Korea Research Institute Of Chemical Technology
Curated by ChEMBL
LigandPNGBDBM50358294(CHEMBL1922409)
Affinity DataIC50:  29nM. Assay description: Inhibition of recombinant c-met by HTRF assay
In DepthDetails ArticlePubMed