BDBM50358415 CHEMBL1922847
SMILES CCCCCCC(=O)[C@@H](O)CC
InChI Key InChIKey=CSZVSWOBRXXFAE-VIFPVBQESA-N
Data  1 EC50
  Tab Delimited (TSV)   2D SDfile   Computed 3D by Vconf -m prep SDfile
Find this compound or compounds like it in BindingDB:
Activity Spreadsheet -- Enzyme Inhibition Constant Data from BindingDB
Found 1 hit for monomerid = 50358415
TargetCAI-1 autoinducer sensor kinase/phosphatase CqsS(Vibrio cholerae serotype O1 (strain ATCC 39315 / E...)
Princeton University
Curated by ChEMBL
LigandPNGBDBM50358415(CHEMBL1922847)
Affinity DataEC50: >5.00E+4nM. Assay description: Agonist activity at CqsS receptor in cqsA-deficient, luxQ-deficient Vibrio cholerae MM920 harboring cosmid pBB1 carrying Vibrio harveyi luxCDABE gene...
In DepthDetails ArticlePubMed