BDBM50358545 CHEMBL1923544
SMILES CCCCCCCCCCCCCCCC(=O)O[C@H](COC(=O)CNCCCOCCOCCOCC)CSC[C@H](N)C(=O)N[C@@H](CO)C(O)=O
InChI Key InChIKey=QORAYKWOIWEGEG-RTOKGZNSSA-N
Data  1 EC50
  Tab Delimited (TSV)   2D SDfile   Computed 3D by Vconf -m prep SDfile
Find this compound or compounds like it in BindingDB:
Activity Spreadsheet -- Enzyme Inhibition Constant Data from BindingDB
Found 1 hit for monomerid = 50358545
TargetToll-like receptor 2(Homo sapiens (Human))
University Of Kansas
Curated by ChEMBL
LigandPNGBDBM50358545(CHEMBL1923544)
Affinity DataEC50:  2.11nM. Assay description: Agonist activity at human TLR2 expressed in HEK293 cells assessed as NF-kappaB induction measured soluble alkaline phosphatase after 12 hrs by spectr...
In DepthDetails ArticlePubMed