BDBM50358695 CHEMBL1922035
SMILES COc1cccc(CNC(=O)c2cc3ccc(nc3n2C)-c2cn[nH]c2)c1
InChI Key InChIKey=CDNDJQNTIHXAGY-UHFFFAOYSA-N
Data  1 IC50
  Tab Delimited (TSV)   2D SDfile   Computed 3D by Vconf -m prep SDfile
Find this compound or compounds like it in BindingDB:
Activity Spreadsheet -- Enzyme Inhibition Constant Data from BindingDB
Found 1 hit for monomerid = 50358695
TargetRho-associated protein kinase 1(Homo sapiens (Human))
The Scripps Research Institute
Curated by ChEMBL
LigandPNGBDBM50358695(CHEMBL1922035)
Affinity DataIC50:  2nM. Assay description: Inhibition of ROCK1
In DepthDetails ArticlePubMed