BDBM50358772 CHEMBL1922599
SMILES Clc1cc2c(cc1Nc1cccc(NC(=O)c3cccc(c3)C#N)c1)c(=O)[nH][nH]c2=O
InChI Key InChIKey=DOSASLICLCWVOI-UHFFFAOYSA-N
Data  1 IC50
  Tab Delimited (TSV)   2D SDfile   Computed 3D by Vconf -m prep SDfile
Find this compound or compounds like it in BindingDB:
Activity Spreadsheet -- Enzyme Inhibition Constant Data from BindingDB
Found 1 hit for monomerid = 50358772
TargetSerine/threonine-protein kinase B-raf(Homo sapiens (Human))
Pfizer
Curated by ChEMBL
LigandPNGBDBM50358772(CHEMBL1922599)
Affinity DataIC50:  296nM. Assay description: Inhibition of human recombinant his6-tagged B-Raf expressed in Sf9 cells assessed as inhibition of MEK1 phosphorylation after 60 mins
In DepthDetails ArticlePubMed