BDBM50358863 CHEMBL1923448
SMILES Clc1ccc2sc(cc2c1)S(=O)(=O)N[C@H]1CCCN(CC(=O)N2CCCC2)C1=O
InChI Key InChIKey=JNIYKCLZQFYAID-HNNXBMFYSA-N
Data  1 IC50
  Tab Delimited (TSV)   2D SDfile   Computed 3D by Vconf -m prep SDfile
Find this compound or compounds like it in BindingDB:
Activity Spreadsheet -- Enzyme Inhibition Constant Data from BindingDB
Found 1 hit for monomerid = 50358863
TargetCoagulation factor X(Homo sapiens (Human))
Bristol-Myers Squibb
Curated by ChEMBL
LigandPNGBDBM50358863(CHEMBL1923448)
Affinity DataIC50:  60nM. Assay description: Inhibition of human factor 10a using phenyl-Ile-Glu-Gly-Arg-pNA as substrate preincubated for 3 mins prior to substrate addition by spectrophotometry
In DepthDetails ArticlePubMed