BDBM50358911 CHEMBL1923587
SMILES CN1CCN(CC1)c1ccc(Nc2ncc3ccc(-c4cccc(c4)S(=O)(=O)NC(C)(C)C)n3n2)cc1Cl
InChI Key InChIKey=DWAWSDBNWWEXEB-UHFFFAOYSA-N
Data  1 IC50
  Tab Delimited (TSV)   2D SDfile   Computed 3D by Vconf -m prep SDfile
Find this compound or compounds like it in BindingDB:
Activity Spreadsheet -- Enzyme Inhibition Constant Data from BindingDB
Found 1 hit for monomerid = 50358911
TargetTyrosine-protein kinase JAK2(Homo sapiens (Human))
Cephalon
Curated by ChEMBL
LigandPNGBDBM50358911(CHEMBL1923587)
Affinity DataIC50:  1.20nM. Assay description: Inhibition of human recombinant JAK2 using biotinyl-amino-hexanoyl-EQEDEPEGDYFEWLE-amide as substrate after 20 mins by fluorescence assay
In DepthDetails ArticlePubMed