BDBM50359233 CHEMBL1923623
SMILES C[C@H]1N(C)C(=O)[C@@H](NCCOc2ccccc2CCCNC(=O)[C@@H](Cc2ccccc2F)NC1=O)C1CC1
InChI Key InChIKey=RGRCEZBNFKRETF-OXTYCOSGSA-N
Data  1 KI
  Tab Delimited (TSV)   2D SDfile   Computed 3D by Vconf -m prep SDfile
Find this compound or compounds like it in BindingDB:
Activity Spreadsheet -- Enzyme Inhibition Constant Data from BindingDB
Found 1 hit for monomerid = 50359233
TargetAppetite-regulating hormone(Homo sapiens (Human))
Tranzyme Pharma
Curated by ChEMBL
LigandPNGBDBM50359233(CHEMBL1923623)
Affinity DataKi:  6.20nM. Assay description: Displacement of [125I-His9]-ghrelin from human GRLN receptor by radioligand binding assay
In DepthDetails ArticlePubMed