BDBM50359270 CHEMBL1923503
SMILES CCC[C@H](NCCOc1ccccc1\C=C\CNC(C)=O)C(=O)N(C)CC(=O)N[C@H](Cc1ccccc1)C(N)=O
InChI Key InChIKey=GZMJBNSYTDELLF-ODPMVMEKSA-N
Data  1 KI
  Tab Delimited (TSV)   2D SDfile   Computed 3D by Vconf -m prep SDfile
Find this compound or compounds like it in BindingDB:
Activity Spreadsheet -- Enzyme Inhibition Constant Data from BindingDB
Found 1 hit for monomerid = 50359270
TargetAppetite-regulating hormone(Homo sapiens (Human))
Tranzyme Pharma
Curated by ChEMBL
LigandPNGBDBM50359270(CHEMBL1923503)
Affinity DataKi: >1.00E+4nM. Assay description: Displacement of [125I-His9]-ghrelin from human GRLN receptor by radioligand binding assay
In DepthDetails ArticlePubMed