BDBM50359280 CHEMBL1923607
SMILES CCC[C@@H]1NCCOc2ccccc2CCCNC(=O)[C@@H](CCCN)NC(=O)CN(C)C1=O
InChI Key InChIKey=KEIVZWATTXRAGZ-UXHICEINSA-N
Data  1 KI
  Tab Delimited (TSV)   2D SDfile   Computed 3D by Vconf -m prep SDfile
Find this compound or compounds like it in BindingDB:
Activity Spreadsheet -- Enzyme Inhibition Constant Data from BindingDB
Found 1 hit for monomerid = 50359280
TargetAppetite-regulating hormone(Homo sapiens (Human))
Tranzyme Pharma
Curated by ChEMBL
LigandPNGBDBM50359280(CHEMBL1923607)
Affinity DataKi: >1.00E+4nM. Assay description: Displacement of [125I-His9]-ghrelin from human GRLN receptor by radioligand binding assay
In DepthDetails ArticlePubMed