BDBM50359438 CHEMBL1926750
SMILES Oc1c2CCCn2c(=O)n1CCCNCC1CCc2ccccc2O1
InChI Key InChIKey=QBJIXXNWWVDIGD-UHFFFAOYSA-N
Data  6 KI  1 EC50
  Tab Delimited (TSV)   2D SDfile   Computed 3D by Vconf -m prep SDfile
Find this compound or compounds like it in BindingDB:
Activity Spreadsheet -- Enzyme Inhibition Constant Data from BindingDB
Found 7 hits for monomerid = 50359438
Target5-hydroxytryptamine receptor 1A(Rattus norvegicus (rat))
Universidad Complutense De Madrid
Curated by ChEMBL
LigandPNGBDBM50359438(CHEMBL1926750)
Affinity DataKi:  8.20nM. Assay description: Displacement of [3H]-8-OH-DPAT from 5-HT1A receptor in Sprague-Dawley albinus rat cerebral cortex membranes after 15 mins
In DepthDetails ArticlePubMed
Target5-hydroxytryptamine receptor 7(Rattus norvegicus (rat))
Universidad Complutense De Madrid
Curated by ChEMBL
LigandPNGBDBM50359438(CHEMBL1926750)
Affinity DataKi:  60nM. Assay description: Displacement of [3H]-5-CT from 5HT7 receptor in Sprague-Dawley albinus rat hypothalamic membranes after 120 mins
In DepthDetails ArticlePubMed
Target5-hydroxytryptamine receptor 2A(Rattus norvegicus (rat))
Universidad Complutense De Madrid
Curated by ChEMBL
LigandPNGBDBM50359438(CHEMBL1926750)
Affinity DataKi: >1.00E+3nM. Assay description: Displacement of [3H]ketanserin from 5HT2A receptor in Sprague-Dawley albinus rat frontal cortex membranes after 15 mins
In DepthDetails ArticlePubMed
TargetD(2) dopamine receptor(Rattus norvegicus (rat))
Universidad Complutense De Madrid
Curated by ChEMBL
LigandPNGBDBM50359438(CHEMBL1926750)
Affinity DataKi: >1.00E+3nM. Assay description: Displacement of [3H]spiperone from dopamine D2 receptor in Sprague-Dawley albinus rat striatal membranes after 15 mins
In DepthDetails ArticlePubMed
Target5-hydroxytryptamine receptor 4(RAT)
Universidad Complutense De Madrid
Curated by ChEMBL
LigandPNGBDBM50359438(CHEMBL1926750)
Affinity DataKi: >1.00E+3nM. Assay description: Displacement of [3H]GR113808 from 5HT4 receptor in Sprague-Dawley albinus rat striatal membranes after 30 mins by scintillation counting
In DepthDetails ArticlePubMed
Target5-hydroxytryptamine receptor 3A(RAT)
Universidad Complutense De Madrid
Curated by ChEMBL
LigandPNGBDBM50359438(CHEMBL1926750)
Affinity DataKi: >1.00E+3nM. Assay description: Displacement of [3H]-LY278584 from 5HT3 receptor in Sprague-Dawley albinus rat cerebral cortex membranes after 30 mins
In DepthDetails ArticlePubMed
Target5-hydroxytryptamine receptor 1A(Homo sapiens (Human))
Universidad Complutense De Madrid
Curated by ChEMBL
LigandPNGBDBM50359438(CHEMBL1926750)
Affinity DataEC50:  23.3nM. Assay description: Agonist activity at human 5HT1A receptor expressed in human HeLa cells assessed as inhibition of forskolin-stimulated cAMP production pretreated 20 m...
In DepthDetails ArticlePubMed