BDBM50359449 CHEMBL1926761
SMILES O=C1N(CCCCNCC2CCc3ccccc3O2)S(=O)(=O)c2ccccc12
InChI Key InChIKey=YGYBFMRFXNDIPO-UHFFFAOYSA-N
Data  1 EC50
  Tab Delimited (TSV)   2D SDfile   Computed 3D by Vconf -m prep SDfile
Find this compound or compounds like it in BindingDB:
Activity Spreadsheet -- Enzyme Inhibition Constant Data from BindingDB
Found 1 hit for monomerid = 50359449
Target5-hydroxytryptamine receptor 1A(Homo sapiens (Human))
Universidad Complutense De Madrid
Curated by ChEMBL
LigandPNGBDBM50359449(CHEMBL1926761)
Affinity DataEC50:  1.5nM. Assay description: Agonist activity at human 5HT1A receptor expressed in human HeLa cells assessed as inhibition of forskolin-stimulated cAMP production pretreated 20 m...
In DepthDetails ArticlePubMed