BDBM50359591 CHEMBL1927698
SMILES COc1cccc(C(=O)NCCCCN2CCc3cc(OC)c(OC)cc3C2)c1O
InChI Key InChIKey=RRTIECMMNJVJOK-UHFFFAOYSA-N
Data  1 KI
  Tab Delimited (TSV)   2D SDfile   Computed 3D by Vconf -m prep SDfile
Find this compound or compounds like it in BindingDB:
Activity Spreadsheet -- Enzyme Inhibition Constant Data from BindingDB
Found 1 hit for monomerid = 50359591
TargetSigma non-opioid intracellular receptor 1(RAT)
University Of Wisconsin School Of Medicine And Public Health
Curated by ChEMBL
LigandPNGBDBM50359591(CHEMBL1927698)
Affinity DataKi:  6.78E+4nM. Assay description: Displacement of (+)-[3H]pentazocine from sigma 1 receptor in rat liver membrane after 1.5 hrs by scintillation counting
In DepthDetails ArticlePubMed