BDBM50359711 CHEMBL1927064
SMILES COc1ccc(cc1)C1=NOC(CC(=O)Oc2cc(C)ccc2C(C)C)C1
InChI Key InChIKey=YZWPLPYRHPWZBP-UHFFFAOYSA-N
Data  1 IC50
  Tab Delimited (TSV)   2D SDfile   Computed 3D by Vconf -m prep SDfile
Find this compound or compounds like it in BindingDB:
Activity Spreadsheet -- Enzyme Inhibition Constant Data from BindingDB
Found 1 hit for monomerid = 50359711
TargetMacrophage migration inhibitory factor(Homo sapiens (Human))
Institute Of Chemical Biology
Curated by ChEMBL
LigandPNGBDBM50359711(CHEMBL1927064)
Affinity DataIC50:  5.53E+4nM. Assay description: Inhibition of human cloned MIF tautomerase activity expressed in Escherichia coli assessed as conversion of L-dopachrome methyl ester to indolecarbox...
In DepthDetails ArticlePubMed