BDBM50359729 CHEMBL1927205
SMILES COc1ccc2oc(=O)c(cc2c1)-c1cn(-c2cccc(c2)C(O)=O)c(=S)[nH]1
InChI Key InChIKey=SAFXYJWXQPZDKB-UHFFFAOYSA-N
Data  1 IC50
  Tab Delimited (TSV)   2D SDfile   Computed 3D by Vconf -m prep SDfile
Find this compound or compounds like it in BindingDB:
Activity Spreadsheet -- Enzyme Inhibition Constant Data from BindingDB
Found 1 hit for monomerid = 50359729
TargetCollagenase 3(Homo sapiens (Human))
Universit£
Curated by ChEMBL
LigandPNGBDBM50359729(CHEMBL1927205)
Affinity DataIC50:  3.20E+3nM. Assay description: Inhibition of human MMP13 using Mca-Lys-Pro-Leu-Gly-Leu-Dap(Dnp)-Ala-Arg-NH2 as substrate pre-incubated for 4 hrs before substrate addition measured ...
In DepthDetails ArticlePubMed