BDBM50359987 CHEMBL1927778
SMILES FC(F)(F)c1cc(CC(=O)N[C@@H](Cc2ccccc2)C(=O)Nc2ccc(cc2)-c2cn3c(n2)sc2cc(Br)ccc32)cc(c1)C(F)(F)F
InChI Key InChIKey=LXAIOMVXAKICRS-SANMLTNESA-N
Data  1 IC50
  Tab Delimited (TSV)   2D SDfile   Computed 3D by Vconf -m prep SDfile
Find this compound or compounds like it in BindingDB:
Activity Spreadsheet -- Enzyme Inhibition Constant Data from BindingDB
Found 1 hit for monomerid = 50359987
TargetHepatocyte growth factor receptor(Homo sapiens (Human))
University Of The Mediterranean
Curated by ChEMBL
LigandPNGBDBM50359987(CHEMBL1927778)
Affinity DataIC50:  7.30E+3nM. Assay description: Inhibition of Met-mediated scattering in HGF-stimulated human MDCK cells pre-incubated overnight prior to HGF stimulation for 24 hrs measured after 2...
In DepthDetails ArticlePubMed