BDBM50360027 CHEMBL1928524
SMILES CN(\N=C\c1cnn2cccc(Br)c12)S(=O)(=O)c1cc(ccc1C)[N+]([O-])=O
InChI Key InChIKey=WEURBRGTQPWYJY-GIJQJNRQSA-N
Data  3 IC50
  Tab Delimited (TSV)   2D SDfile   Computed 3D by Vconf -m prep SDfile
Find this compound or compounds like it in BindingDB:
Activity Spreadsheet -- Enzyme Inhibition Constant Data from BindingDB
Found 3 hits for monomerid = 50360027
TargetPhosphatidylinositol 4,5-bisphosphate 3-kinase catalytic subunit alpha isoform(Homo sapiens (Human))
University Of Auckland
Curated by ChEMBL
LigandPNGBDBM50360027(CHEMBL1928524)
Affinity DataIC50: >1.00E+3nM. Assay description: Inhibition of recombinant PI3K p110alpha using L-alpha-phosphotidylinositol as substrate and [gamma33P]ATP after 60 mins by thin layer chromatographi...
In DepthDetails ArticlePubMed
TargetPhosphatidylinositol 4,5-bisphosphate 3-kinase catalytic subunit delta isoform(Homo sapiens (Human))
University Of Auckland
Curated by ChEMBL
LigandPNGBDBM50360027(CHEMBL1928524)
Affinity DataIC50: >1.00E+3nM. Assay description: Inhibition of recombinant PI3K p110delta using L-alpha-phosphotidylinositol as substrate and [gamma33P]ATP after 60 mins by thin layer chromatographi...
In DepthDetails ArticlePubMed
TargetPhosphatidylinositol 4,5-bisphosphate 3-kinase catalytic subunit beta isoform(Homo sapiens (Human))
University Of Auckland
Curated by ChEMBL
LigandPNGBDBM50360027(CHEMBL1928524)
Affinity DataIC50: >1.00E+3nM. Assay description: Inhibition of recombinant PI3K p110beta using L-alpha-phosphotidylinositol as substrate and [gamma33P]ATP after 60 mins by thin layer chromatographic...
In DepthDetails ArticlePubMed