BDBM50360274 CHEMBL1933101
SMILES OC(=O)C(CCCc1ccccc1)NC(=O)c1ccccc1NC(=O)c1cc2ccccc2[nH]1
InChI Key InChIKey=MHWJDMSLBDLKCZ-UHFFFAOYSA-N
Data  1 IC50
  Tab Delimited (TSV)   2D SDfile   Computed 3D by Vconf -m prep SDfile
Find this compound or compounds like it in BindingDB:
Activity Spreadsheet -- Enzyme Inhibition Constant Data from BindingDB
Found 1 hit for monomerid = 50360274
TargetCholecystokinin receptor type A(RAT)
University Of Trieste
Curated by ChEMBL
LigandPNGBDBM50360274(CHEMBL1933101)
Affinity DataIC50:  107nM. Assay description: Displacement of [125I]-BH-CCK8 from CCK1 receptor in Sprague-Dawley rat pancreatic acini after 120 hrs by gamma-counting
In DepthDetails ArticlePubMed