BDBM50360540 CHEMBL1933151
SMILES Cc1ccc(OCCOc2ccc(Cl)cc2Cl)c(I)n1
InChI Key InChIKey=RSHQCAXNQDJUOW-UHFFFAOYSA-N
Data  1 EC50
  Tab Delimited (TSV)   2D SDfile   Computed 3D by Vconf -m prep SDfile
Find this compound or compounds like it in BindingDB:
Activity Spreadsheet -- Enzyme Inhibition Constant Data from BindingDB
Found 1 hit for monomerid = 50360540
TargetSphingosine 1-phosphate receptor 4(Homo sapiens (Human))
The Scripps Research Institute
Curated by ChEMBL
LigandPNGBDBM50360540(CHEMBL1933151)
Affinity DataEC50:  54nM. Assay description: Agonist activity at human S1P4R expressed in human U2OS cells containing EDG6 gene co-expressing GAL4-VP16 and beta-arrestin/TEV protease assessed as...
In DepthDetails ArticlePubMed