BDBM50360587 CHEMBL1933353
SMILES CCCC(Oc1cnn(c1)-c1ccc(C)cc1)c1ccc(cc1)C(=O)NCCC(O)=O
InChI Key InChIKey=XXMYSVUWQYCGOX-UHFFFAOYSA-N
Data  1 KI
  Tab Delimited (TSV)   2D SDfile   Computed 3D by Vconf -m prep SDfile
Find this compound or compounds like it in BindingDB:
Activity Spreadsheet -- Enzyme Inhibition Constant Data from BindingDB
Found 1 hit for monomerid = 50360587
TargetGlucagon receptor(Homo sapiens (Human))
Pfizer
Curated by ChEMBL
LigandPNGBDBM50360587(CHEMBL1933353)
Affinity DataKi:  968nM. Assay description: Displacement of [125I]Glucagon-Cex from human GCGR
In DepthDetails ArticlePubMed