BDBM50360809 CHEMBL1934675
SMILES COc1ccc(cc1Cl)-c1c(O)c2ccccc2oc1=O
InChI Key InChIKey=LPWGIOPIJFFKOY-UHFFFAOYSA-N
Data  1 IC50
  Tab Delimited (TSV)   2D SDfile   Computed 3D by Vconf -m prep SDfile
Find this compound or compounds like it in BindingDB:
Activity Spreadsheet -- Enzyme Inhibition Constant Data from BindingDB
Found 1 hit for monomerid = 50360809
TargetAmine oxidase [flavin-containing] B(Homo sapiens (Human))
Universit£
Curated by ChEMBL
LigandPNGBDBM50360809(CHEMBL1934675)
Affinity DataIC50:  9.26E+3nM. Assay description: Inhibition of human recombinant MAOB expressed in baculovirus-infected BTI insect cells assessed as using transformed p-tyramine after 15 mins by flu...
In DepthDetails ArticlePubMed