BDBM50362313 CHEMBL1939739
SMILES Fc1ccc(CN2CCN(CC2)[C@H](c2ccc(cc2)C(=O)N2CCC2)c2cccc(NC(=O)C3CC3)c2)cc1
InChI Key InChIKey=LYTCXQWSMLSBBT-SSEXGKCCSA-N
Data  2 IC50
  Tab Delimited (TSV)   2D SDfile   Computed 3D by Vconf -m prep SDfile
Find this compound or compounds like it in BindingDB:
Activity Spreadsheet -- Enzyme Inhibition Constant Data from BindingDB
Found 2 hits for monomerid = 50362313
TargetPotassium voltage-gated channel subfamily H member 2(Homo sapiens (Human))
Astrazeneca Pharmaceuticals
Curated by ChEMBL
LigandPNGBDBM50362313(CHEMBL1939739)
Affinity DataIC50:  3.60E+3nM. Assay description: Inhibition of human Erg
In DepthDetails ArticlePubMed
TargetDelta-type opioid receptor(Homo sapiens (Human))
Astrazeneca Pharmaceuticals
Curated by ChEMBL
LigandPNGBDBM50362313(CHEMBL1939739)
Affinity DataIC50:  0.900nM. Assay description: Displacement of [I125]deltorphin from delta-opioid receptor overexpressed in human HEK293 cells
In DepthDetails ArticlePubMed