BDBM50362469 CHEMBL1940551
SMILES C[C@]12C[C@H](O)[C@H]3[C@@H](CCC4=CC(=O)C=C[C@]34C)[C@@H]1CC[C@]2(O)C(=O)CSc1nc2ncccc2o1
InChI Key InChIKey=OUZHVOJEKVWAPH-TZDXYYDNSA-N
Data  1 IC50
  Tab Delimited (TSV)   2D SDfile   Computed 3D by Vconf -m prep SDfile
Find this compound or compounds like it in BindingDB:
Activity Spreadsheet -- Enzyme Inhibition Constant Data from BindingDB
Found 1 hit for monomerid = 50362469
TargetGlucocorticoid receptor(Homo sapiens (Human))
Merck Research Laboratories
Curated by ChEMBL
LigandPNGBDBM50362469(CHEMBL1940551)
Affinity DataIC50:  17.2nM. Assay description: Transrepression activity at glucocorticoid receptor in human H292 cells assessed as inhibition of TNF-stimulated IL-8 production
In DepthDetails ArticlePubMed