BDBM50362629 CHEMBL1939046
SMILES CCC#CCOc1nc2oc(=O)cc(CCC3CCCC3)c2c(=O)[nH]1
InChI Key InChIKey=AKNPQHAANMCYGO-UHFFFAOYSA-N
Data  1 EC50
  Tab Delimited (TSV)   2D SDfile   Computed 3D by Vconf -m prep SDfile
Find this compound or compounds like it in BindingDB:
Activity Spreadsheet -- Enzyme Inhibition Constant Data from BindingDB
Found 1 hit for monomerid = 50362629
TargetHydroxycarboxylic acid receptor 2(Homo sapiens (Human))
Merck Research Laboratory
Curated by ChEMBL
LigandPNGBDBM50362629(CHEMBL1939046)
Affinity DataEC50:  172nM. Assay description: Agonist activity at human HM74A
In DepthDetails ArticlePubMed