BDBM50362827 CHEMBL1940186
SMILES CC(C)(C)c1ccc(CNC(=O)C2(CC2)c2ccc(NS(C)(=O)=O)cc2)cc1
InChI Key InChIKey=WYFHMAYTPGRAGJ-UHFFFAOYSA-N
Data  2 KI
  Tab Delimited (TSV)   2D SDfile   Computed 3D by Vconf -m prep SDfile
Find this compound or compounds like it in BindingDB:
Activity Spreadsheet -- Enzyme Inhibition Constant Data from BindingDB
Found 2 hits for monomerid = 50362827
TargetTransient receptor potential cation channel subfamily V member 1(Rattus norvegicus (rat))
Shenyang Pharmaceutical University
Curated by ChEMBL
LigandPNGBDBM50362827(CHEMBL1940186)
Affinity DataKi:  610nM. Assay description: Displacement of [3H]RTX from rat TRPV1 expressed in CHO cells
In DepthDetails ArticlePubMed
TargetTransient receptor potential cation channel subfamily V member 1(Rattus norvegicus (rat))
Shenyang Pharmaceutical University
Curated by ChEMBL
LigandPNGBDBM50362827(CHEMBL1940186)
Affinity DataKi:  1.77E+3nM. Assay description: Antagonist activity at rat TRPV1 expressed in CHO cells by 45Ca2+ uptake assay
In DepthDetails ArticlePubMed