BDBM50362994 CHEMBL1946760
SMILES COc1cc2c(cc1Cl)N=C(N[C@@H](C)CO)NS2(=O)=O
InChI Key InChIKey=AEVJNSJUOFUSKL-LURJTMIESA-N
Data  1 IC50
  Tab Delimited (TSV)   2D SDfile   Computed 3D by Vconf -m prep SDfile
Find this compound or compounds like it in BindingDB:
Activity Spreadsheet -- Enzyme Inhibition Constant Data from BindingDB
Found 1 hit for monomerid = 50362994
TargetATP-binding cassette sub-family C member 8(Rattus norvegicus)
Universit£
Curated by ChEMBL
LigandPNGBDBM50362994(CHEMBL1946760)
Affinity DataIC50: >1.00E+4nM. Assay description: Activation of SUR1 in rat pancreatic islets assessed as inhibition of glucose-induced insulin secretion
In DepthDetails ArticlePubMed