BDBM50363502 CHEMBL1946178
SMILES COc1cc(CC2CCCCC2OC(=O)c2cc(cc(c2)[N+]([O-])=O)[N+]([O-])=O)c(Br)c(Br)c1OC
InChI Key InChIKey=XRIPWOSGXFVJPA-UHFFFAOYSA-N
Data  4 KI
  Tab Delimited (TSV)   2D SDfile   Computed 3D by Vconf -m prep SDfile
Find this compound or compounds like it in BindingDB:
Activity Spreadsheet -- Enzyme Inhibition Constant Data from BindingDB
Found 4 hits for monomerid = 50363502
TargetCarbonic anhydrase 2(Homo sapiens (Human))
Artvin£Oruh University
Curated by ChEMBL
LigandPNGBDBM50363502(CHEMBL1946178)
Affinity DataKi:  840nM. Assay description: Inhibition of human carbonic anhydrase 2 esterase activity using 4-nitrophenylacetate as substrate
In DepthDetails ArticlePubMed
TargetCarbonic anhydrase 6(Homo sapiens (Human))
Artvin£Oruh University
Curated by ChEMBL
LigandPNGBDBM50363502(CHEMBL1946178)
Affinity DataKi:  960nM. Assay description: Inhibition of human carbonic anhydrase 6 esterase activity using 4-nitrophenylacetate as substrate
In DepthDetails ArticlePubMed
TargetCarbonic anhydrase 4(Homo sapiens (Human))
Artvin£Oruh University
Curated by ChEMBL
LigandPNGBDBM50363502(CHEMBL1946178)
Affinity DataKi:  1.12E+3nM. Assay description: Inhibition of human carbonic anhydrase 4 esterase activity using 4-nitrophenylacetate as substrate
In DepthDetails ArticlePubMed
TargetCarbonic anhydrase 1(Homo sapiens (Human))
Artvin£Oruh University
Curated by ChEMBL
LigandPNGBDBM50363502(CHEMBL1946178)
Affinity DataKi:  2.45E+3nM. Assay description: Inhibition of human carbonic anhydrase 1 esterase activity using 4-nitrophenylacetate as substrate
In DepthDetails ArticlePubMed