BDBM50363515 CHEMBL1946092
SMILES CN(Cc1ccccc1)C(=O)C1CCCc2c1c1ccccc1n2CCF
InChI Key InChIKey=FJAMEGHJYXTEHB-UHFFFAOYSA-N
Data  1 KI
  Tab Delimited (TSV)   2D SDfile   Computed 3D by Vconf -m prep SDfile
Find this compound or compounds like it in BindingDB:
Activity Spreadsheet -- Enzyme Inhibition Constant Data from BindingDB
Found 1 hit for monomerid = 50363515
TargetTranslocator protein(Rattus norvegicus (rat))
Ge Healthcare
Curated by ChEMBL
LigandPNGBDBM50363515(CHEMBL1946092)
Affinity DataKi:  1.30nM. Assay description: Displacement of [3H]PK11195 from TSPO receptor in Wistar rat heart homogenate after 15 mins
In DepthDetails ArticlePubMed