BDBM50363696 CHEMBL1945922
SMILES COc1cccc(c1)-c1ccc(NS(=O)(=O)c2ccc3cc(OC)ccc3c2)cc1
InChI Key InChIKey=YTKBMDAKISCPDR-UHFFFAOYSA-N
Data  1 IC50
  Tab Delimited (TSV)   2D SDfile   Computed 3D by Vconf -m prep SDfile
Find this compound or compounds like it in BindingDB:
Activity Spreadsheet -- Enzyme Inhibition Constant Data from BindingDB
Found 1 hit for monomerid = 50363696
TargetUrokinase-type plasminogen activator(Homo sapiens (Human))
University Of Antwerp
Curated by ChEMBL
LigandPNGBDBM50363696(CHEMBL1945922)
Affinity DataIC50:  1.90E+4nM. Assay description: Inhibition of human uPA using pyroGlu-Gly-Arg-p-NA.HCl as substrate preincubated for 15 mins prior sustrate addition measured for 10 mins by spectrop...
In DepthDetails ArticlePubMed