BDBM50364027 CHEMBL1950399
SMILES OC(=O)c1cncc(n1)-c1ccc(nn1)N1CCC(CC1)Oc1cc(F)ccc1Br
InChI Key InChIKey=PTOHTFKIEXXAOA-UHFFFAOYSA-N
Data  1 IC50
  Tab Delimited (TSV)   2D SDfile   Computed 3D by Vconf -m prep SDfile
Find this compound or compounds like it in BindingDB:
Activity Spreadsheet -- Enzyme Inhibition Constant Data from BindingDB
Found 1 hit for monomerid = 50364027
TargetAcyl-CoA desaturase 1(Rattus norvegicus (Rat))
Merck Frosst Centre For Therapeutic Research
Curated by ChEMBL
LigandPNGBDBM50364027(CHEMBL1950399)
Affinity DataIC50:  772nM. Assay description: Inhibition of rat SCD1
In DepthDetails ArticlePubMed