BDBM50364604 CHEMBL1951158
SMILES Cc1cc(ccc1Oc1ccccc1)-c1nc(no1)-c1csc(CN2CC(C2)C(O)=O)c1
InChI Key InChIKey=UICOPSLHFMXOQP-UHFFFAOYSA-N
Data  2 EC50
  Tab Delimited (TSV)   2D SDfile   Computed 3D by Vconf -m prep SDfile
Find this compound or compounds like it in BindingDB:
Activity Spreadsheet -- Enzyme Inhibition Constant Data from BindingDB
Found 2 hits for monomerid = 50364604
TargetSphingosine 1-phosphate receptor 3(Homo sapiens (Human))
Daiichi Sankyo
Curated by ChEMBL
LigandPNGBDBM50364604(CHEMBL1951158)
Affinity DataEC50:  3.00E+3nM. Assay description: Agonist activity at human S1P3 receptor assessed as stimulation of [35S]GTPgamma binding
In DepthDetails ArticlePubMed
TargetSphingosine 1-phosphate receptor 1(Homo sapiens (Human))
Daiichi Sankyo
Curated by ChEMBL
LigandPNGBDBM50364604(CHEMBL1951158)
Affinity DataEC50:  21nM. Assay description: Agonist activity at human S1P1 receptor assessed as stimulation of [35S]GTPgamma binding
In DepthDetails ArticlePubMed