BDBM50364646 CHEMBL1951343
SMILES O=C(Nc1ccc(cc1)-c1ccnc2nc[nH]c12)Nc1cccc(c1)C(=O)N1CCOCC1
InChI Key InChIKey=UTAKVGKVXLTUNW-UHFFFAOYSA-N
Data  2 IC50
  Tab Delimited (TSV)   2D SDfile   Computed 3D by Vconf -m prep SDfile
Find this compound or compounds like it in BindingDB:
Activity Spreadsheet -- Enzyme Inhibition Constant Data from BindingDB
Found 2 hits for monomerid = 50364646
TargetCytochrome P450 3A5(Homo sapiens (Human))
The Scripps Research Institute
Curated by ChEMBL
LigandPNGBDBM50364646(CHEMBL1951343)
Affinity DataIC50:  6.00E+4nM. Assay description: Inhibition of recombinant human CYP3A5 in supersomes using midazolam as substrate after 5 mins by LC-MS/MS analysis
In DepthDetails ArticlePubMed
TargetCytochrome P450 3A4(Homo sapiens (Human))
The Scripps Research Institute
Curated by ChEMBL
LigandPNGBDBM50364646(CHEMBL1951343)
Affinity DataIC50:  290nM. Assay description: Inhibition of recombinant human CYP3A4 in supersomes using midazolam as substrate after 5 mins by LC-MS/MS analysis
In DepthDetails ArticlePubMed