BDBM50364746 CHEMBL1951917
SMILES CCN(C1CCN(CC[C@H](C2CCN(CC2)S(C)(=O)=O)c2cccc(Cl)c2)CC1)C(=O)Cc1ccc(cc1)S(C)(=O)=O
InChI Key InChIKey=KYLOZBUIUJEBQB-SSEXGKCCSA-N
Data  2 IC50
  Tab Delimited (TSV)   2D SDfile   Computed 3D by Vconf -m prep SDfile
Find this compound or compounds like it in BindingDB:
Activity Spreadsheet -- Enzyme Inhibition Constant Data from BindingDB
Found 2 hits for monomerid = 50364746
TargetPotassium voltage-gated channel subfamily H member 2(Homo sapiens (Human))
Astrazeneca
Curated by ChEMBL
LigandPNGBDBM50364746(CHEMBL1951917)
Affinity DataIC50:  7.90E+3nM. Assay description: Displacement of 3,7-Bis[2-(4-nitro[3,5-3H]phenyl)ethyl]-3,7-diazabicyclo[3.3.1]nonane from human ERG expressed in HEK cells after 3 hrs
In DepthDetails ArticlePubMed
TargetC-C chemokine receptor type 5(Homo sapiens (Human))
Astrazeneca
Curated by ChEMBL
LigandPNGBDBM50364746(CHEMBL1951917)
Affinity DataIC50:  0.550nM. Assay description: Displacement of [125I]MIP-1alpha from human recombinant CCR5 expressed in CHO cells
In DepthDetails ArticlePubMed