BDBM50364908 CHEMBL1950135
SMILES CCNCCOc1ccc2-c3ccc(OCCNCC)cc3C(=O)c2c1
InChI Key InChIKey=SKGBXDYSNPSLFB-UHFFFAOYSA-N
Data  1 KI
  Tab Delimited (TSV)   2D SDfile   Computed 3D by Vconf -m prep SDfile
Find this compound or compounds like it in BindingDB:
Activity Spreadsheet -- Enzyme Inhibition Constant Data from BindingDB
Found 1 hit for monomerid = 50364908
TargetNeuronal acetylcholine receptor subunit alpha-7(Rattus norvegicus (Rat))
Abbott Laboratories
Curated by ChEMBL
LigandPNGBDBM50364908(CHEMBL1950135)
Affinity DataKi:  950nM. Assay description: Displacement of [3H]methyllylcaconitine from alpha7 nAChR in rat brain
In DepthDetails ArticlePubMed