BDBM50365004 CHEMBL1950772
SMILES Cn1c2CC3CCC(N3)c2c2cc(ccc12)S(=O)(=O)n1cccc1
InChI Key InChIKey=UJWBECOMJZTGRV-UHFFFAOYSA-N
Data  1 KI
  Tab Delimited (TSV)   2D SDfile   Computed 3D by Vconf -m prep SDfile
Find this compound or compounds like it in BindingDB:
Activity Spreadsheet -- Enzyme Inhibition Constant Data from BindingDB
Found 1 hit for monomerid = 50365004
Target5-hydroxytryptamine receptor 6(Homo sapiens (Human))
Amri
Curated by ChEMBL
LigandPNGBDBM50365004(CHEMBL1950772)
Affinity DataKi:  32nM. Assay description: Displacement of [3H]LSD from human 5-HT6 serotonin receptor by scintillation proximity assay
In DepthDetails ArticlePubMed